Target
Bromodomain-containing protein 4
Ligand
BDBM243315
Substrate
Meas. Tech.
Time Resolved Fluorescence Resonance Energy Transfer (TR-FRET) Assay
IC50
<5000±n/a nM
Citation
 Poss, MATortolani, DRPurandare, AVTokarski, JSMussari, CPKamau, MGDodd, DSGavai, AVO Malley, DHuynh, TNVaccaro, WHarikrishnan, LS Carbazole compounds useful as bromodomain inhibitors US Patent  US10196387 Publication Date 2/5/2019 
Target
Name:
Bromodomain-containing protein 4
Synonyms:
BRD4 Bromodomain-containing protein 4 (BRD4) Protein HUNK1
Type:
Protein
Mol. Mass.:
152264.84
Organism:
Homo sapiens (Human)
Description:
O60885
Residue:
1362
  
Inhibitor
Name:
BDBM243315
Synonyms:
US10053454, Example 59 | US10196387, Example 59
Type:
Small organic molecule
Emp. Form.:
C27H26N4O3
Mol. Mass.:
454.5203
SMILES:
Cc1noc(C)c1-c1cc(C#N)c2n(CC3CC3)c3cc(ccc3c2c1)C(=O)N1CCOCC1
: