Target
Dipeptidyl peptidase 9
Ligand
BDBM12654
Substrate
BDBM11057
Meas. Tech.
DPP Inhibition Assay
pH
7.5±n/a
Temperature
295.15±n/a K
Ki
430±n/a nM
Comments
Result is from racemic analogues.
Citation
 Pei, ZLi, Xvon Geldern, TWMadar, DJLongenecker, KYong, HLubben, THStewart, KDZinker, BABackes, BJJudd, ASMulhern, MBallaron, SJStashko, MAMika, AKBeno, DWReinhart, GAFryer, RMPreusser, LCKempf-Grote, AJSham, HLTrevillyan, JM Discovery of ((4R,5S)-5-amino-4-(2,4,5- trifluorophenyl)cyclohex-1-enyl)-(3- (trifluoromethyl)-5,6-dihydro- [1,2,4]triazolo[4,3-a]pyrazin-7(8H)-yl)methanone (ABT-341), a highly potent, selective, orally efficacious, and safe dipeptidyl peptidase IV inhibitor for the treatment of type 2 diabetes. J Med Chem 49:6439-42 (2006)  
Target
Name:
Dipeptidyl peptidase 9
Synonyms:
DPP9 DPRP-2 Dipeptidyl peptidase 9 (DDP9) Dipeptidyl peptidase 9 (DPP9) Dipeptidyl peptidase IX Dipeptidyl peptidase-like protein 9
Type:
Enzyme
Mol. Mass.:
98260.70
Organism:
Homo sapiens (Human)
Description:
Q86TI2
Residue:
863
  
Inhibitor
Name:
BDBM12654
Synonyms:
(1S,6R)-3-(3-carbamoylphenoxymethyl)-6-(2,4,5-trifluorophenyl)cyclohex-3-en-1-aminium; 2,2,2-trifluoroacetate ABT-341 analogue 17
Type:
Small organic molecule
Emp. Form.:
C20H20F3N2O2
Mol. Mass.:
377.3797
SMILES:
NC(=O)c1cccc(OCC2=CC[C@@H]([C@@H]([NH3+])C2)c2cc(F)c(F)cc2F)c1
:
Substrate
Name:
BDBM11057
Synonyms:
1-(2-aminoacetyl)-N-(4-methyl-2-oxo-2H-chromen-7-yl)pyrrolidine-2-carboxamide hydrobromide Gly-Pro-7-amidomethylcoumarin | Gly-Pro-AMC
Type:
Small organic molecule
Emp. Form.:
C17H19N3O4
Mol. Mass.:
329.3505
SMILES:
Cc1cc(=O)oc2cc(NC(=O)C3CCCN3C(=O)CN)ccc12
: