Target
Bromodomain-containing protein 4
Ligand
BDBM243332
Substrate
Meas. Tech.
Time Resolved Fluorescence Resonance Energy Transfer (TR-FRET) Assay
IC50
<50±n/a nM
Citation
 Poss, MATortolani, DRPurandare, AVTokarski, JSMussari, CPKamau, MGDodd, DSGavai, AVO Malley, DHuynh, TNVaccaro, WHarikrishnan, LS Carbazole compounds useful as bromodomain inhibitors US Patent  US10196387 Publication Date 2/5/2019 
Target
Name:
Bromodomain-containing protein 4
Synonyms:
BRD4 Bromodomain-containing protein 4 (BRD4) Protein HUNK1
Type:
Protein
Mol. Mass.:
152264.84
Organism:
Homo sapiens (Human)
Description:
O60885
Residue:
1362
  
Inhibitor
Name:
BDBM243332
Synonyms:
US10053454, Example 76 | US10196387, Example 76
Type:
Small organic molecule
Emp. Form.:
C27H27F3N4O7S
Mol. Mass.:
608.586
SMILES:
C[C@H]1CN(C[C@@H](C)O1)C(=O)c1cc(OC(F)(F)F)cc2n(c3c(cc(cc3c12)-c1c(C)noc1C)C(N)=O)S(C)(=O)=O
: