Target
Coagulation factor X
Ligand
BDBM12700
Substrate
BDBM12658
Meas. Tech.
Enzyme Assay and Determination of the Inhibition Constants.
pH
7±n/a
Temperature
295.15±n/a K
Ki
0.16±n/a nM
Citation
 Pinto, DJOrwat, MJQuan, MLHan, QGalemmo, RAAmparo, EWells, BEllis, CHe, MYAlexander, RSRossi, KASmallwood, AWong, PCLuettgen, JMRendina, ARKnabb, RMMersinger, LKettner, CBai, SHe, KWexler, RRLam, PY 1-[3-Aminobenzisoxazol-5'-yl]-3-trifluoromethyl-6-[2'-(3-(R)-hydroxy-N-pyrrolidinyl)methyl-[1,1']-biphen-4-yl]-1,4,5,6-tetrahydropyrazolo-[3,4-c]-pyridin-7-one (BMS-740808) a highly potent, selective, efficacious, and orally bioavailable inhibitor of blood coagulation factor Xa. Bioorg Med Chem Lett 16:4141-7 (2006)  
Target
Name:
Coagulation factor X
Synonyms:
Activated coagulation factor X (FXa) Coagulation factor X precursor F10 Factor X heavy chain Factor Xa Stuart-Prower factor
Type:
Enzyme
Mol. Mass.:
54726.60
Organism:
Homo sapiens (Human)
Description:
Residue:
488
  
Inhibitor
Name:
BDBM12700
Synonyms:
1-(3-amino-1,2-benzoxazol-5-yl)-6-[2-fluoro-4-(2-{[(3R)-3-hydroxypyrrolidin-1-yl]methyl}phenyl)phenyl]-3-(trifluoromethyl)-1H,4H,5H,6H,7H-pyrazolo[3,4-c]pyridin-7-one | BMS-740808 Analogue 7c
Type:
Small organic molecule
Emp. Form.:
C31H26F4N6O3
Mol. Mass.:
606.5702
SMILES:
Nc1noc2ccc(cc12)-n1nc(c2CCN(C(=O)c12)c1ccc(cc1F)-c1ccccc1CN1CC[C@@H](O)C1)C(F)(F)F
:
Substrate
Name:
BDBM12658
Synonyms:
4-[({[(1S)-4-carbamimidamido-1-[(4-nitrophenyl)carbamoyl]butyl]carbamoyl}methyl)carbamoyl]-4-[(2S,3S)-3-methyl-2-(phenylformamido)pentanamido]butanoic acid hydrochloride Chromogenic Substrate S-2222 benzoyl-Ile-Glu-Gly-Arg-p-nitroanilide
Type:
Small organic molecule
Emp. Form.:
C32H43N9O9
Mol. Mass.:
697.7387
SMILES:
[#6]-[#6]-[#6@H](-[#6])-[#6@H](-[#7]-[#6](=O)-c1ccccc1)-[#6](=O)-[#7]-[#6@@H](-[#6]-[#6]-[#6](-[#8])=O)-[#6](=O)-[#7]-[#6]-[#6](=O)-[#7]-[#6@@H](-[#6]-[#6]-[#6]\[#7]=[#6](\[#7])-[#7])-[#6](=O)-[#7]-c1ccc(cc1)-[#7+](-[#8-])=O
: