Target
Genome polyprotein
Ligand
BDBM333004
Substrate
Meas. Tech.
HBsAg Assay
IC50
17824±n/a nM
Citation
 Cheng, ZWang, MYang, S Tetrahydropyridopyrimidines and tetrahydropyridopyridines for the treatment and prophylaxis of hepatitis B virus infection US Patent  US10196391 Publication Date 2/5/2019 
Target
Name:
Genome polyprotein
Synonyms:
Hepatitis GB virus B NS5B RNA-dependent RNA polymerase | POLG_GBVB
Type:
PROTEIN
Mol. Mass.:
312770.83
Organism:
Hepatitis GB virus B
Description:
ChEMBL_330657
Residue:
2864
  
Inhibitor
Name:
BDBM333004
Synonyms:
US10196391, Example 4
Type:
Small organic molecule
Emp. Form.:
C20H20N4O2S
Mol. Mass.:
380.463
SMILES:
Cc1cccnc1-c1ncc2CN(CCc2n1)c1ccc(cc1)S(C)(=O)=O
: