Target
Genome polyprotein
Ligand
BDBM333040
Substrate
Meas. Tech.
HBsAg Assay
IC50
669±n/a nM
Citation
 Cheng, ZWang, MYang, S Tetrahydropyridopyrimidines and tetrahydropyridopyridines for the treatment and prophylaxis of hepatitis B virus infection US Patent  US10196391 Publication Date 2/5/2019 
Target
Name:
Genome polyprotein
Synonyms:
Hepatitis GB virus B NS5B RNA-dependent RNA polymerase | POLG_GBVB
Type:
PROTEIN
Mol. Mass.:
312770.83
Organism:
Hepatitis GB virus B
Description:
ChEMBL_330657
Residue:
2864
  
Inhibitor
Name:
BDBM333040
Synonyms:
US10196391, Example 40
Type:
Small organic molecule
Emp. Form.:
C19H17FN4
Mol. Mass.:
320.3635
SMILES:
Cc1cc(F)cc(c1)N1CCc2nc(ncc2C1)-c1ccccn1
: