Target
Genome polyprotein
Ligand
BDBM333090
Substrate
Meas. Tech.
HBsAg Assay
IC50
933±n/a nM
Citation
 Cheng, ZWang, MYang, S Tetrahydropyridopyrimidines and tetrahydropyridopyridines for the treatment and prophylaxis of hepatitis B virus infection US Patent  US10196391 Publication Date 2/5/2019 
Target
Name:
Genome polyprotein
Synonyms:
Hepatitis GB virus B NS5B RNA-dependent RNA polymerase | POLG_GBVB
Type:
PROTEIN
Mol. Mass.:
312770.83
Organism:
Hepatitis GB virus B
Description:
ChEMBL_330657
Residue:
2864
  
Inhibitor
Name:
BDBM333090
Synonyms:
US10196391, Example 90
Type:
Small organic molecule
Emp. Form.:
C19H17FN4O
Mol. Mass.:
336.3629
SMILES:
COc1cc(ccc1F)N1CCc2nc(ncc2C1)-c1ccccn1
: