Target
Genome polyprotein
Ligand
BDBM333099
Substrate
Meas. Tech.
HBsAg Assay
IC50
100.0±n/a nM
Citation
 Cheng, ZWang, MYang, S Tetrahydropyridopyrimidines and tetrahydropyridopyridines for the treatment and prophylaxis of hepatitis B virus infection US Patent  US10196391 Publication Date 2/5/2019 
Target
Name:
Genome polyprotein
Synonyms:
Hepatitis GB virus B NS5B RNA-dependent RNA polymerase | POLG_GBVB
Type:
PROTEIN
Mol. Mass.:
312770.83
Organism:
Hepatitis GB virus B
Description:
ChEMBL_330657
Residue:
2864
  
Inhibitor
Name:
BDBM333099
Synonyms:
US10196391, Example 99
Type:
Small organic molecule
Emp. Form.:
C17H15FN6O
Mol. Mass.:
338.339
SMILES:
COc1cc(F)nc(c1)N1CCc2nc(ncc2C1)-c1ncccn1
: