Target
Tyrosine-protein kinase JAK1
Ligand
BDBM333122
Substrate
Meas. Tech.
Biochemical JAK Kinase Assays
Ki
0.100±n/a nM
Citation
 Fatheree, PRBrandt, GESmith, CSullivan, SDVan Orden, LJ JAK inhibitors containing a 4-membered heterocyclic amide US Patent  US10196393 Publication Date 2/5/2019 
Target
Name:
Tyrosine-protein kinase JAK1
Synonyms:
JAK-1 JAK1A JAK1_HUMAN Janus kinase 1 (JAK1) | Janus kinase 1 JAK1
Type:
Protein
Mol. Mass.:
133293.73
Organism:
Homo sapiens (Human)
Description:
P23458
Residue:
1154
  
Inhibitor
Name:
BDBM333122
Synonyms:
(S)-(3-(dimethylamino)-3-methylazetidin-1-yl)(2-(6-(2-ethyl-5-fluoro-4-hydroxyphenyl)-1H-indazol-3-yl)-5-propyl-4,5,6,7-tetrahydro-3H-imidazo[4,5-c]pyridin-6-yl)methanone US10196393, Example 8-1 US10196393, Example 8-11 US10196393, Example 8-13 US10196393, Example 8-16 US10196393, Example 8-18 US10196393, Example 8-2 US10196393, Example 8-21 US10196393, Example 8-4 US10196393, Example 8-6 US10196393, Example 8-8 US10550118, Example 8 US11453668, Example 8 | US11634419, Example C-6
Type:
Small organic molecule
Emp. Form.:
C31H38FN7O2
Mol. Mass.:
559.6775
SMILES:
CCCN1Cc2[nH]c(nc2C[C@H]1C(=O)N1CC(C)(C1)N(C)C)-c1n[nH]c2cc(ccc12)-c1cc(F)c(O)cc1CC
: