Target
Tyrosine-protein kinase JAK1
Ligand
BDBM333136
Substrate
Meas. Tech.
Biochemical JAK Kinase Assays
Ki
0.080±n/a nM
Citation
 Fatheree, PRBrandt, GESmith, CSullivan, SDVan Orden, LJ JAK inhibitors containing a 4-membered heterocyclic amide US Patent  US10196393 Publication Date 2/5/2019 
Target
Name:
Tyrosine-protein kinase JAK1
Synonyms:
JAK-1 JAK1A JAK1_HUMAN Janus kinase 1 (JAK1) | Janus kinase 1 JAK1
Type:
Protein
Mol. Mass.:
133293.73
Organism:
Homo sapiens (Human)
Description:
P23458
Residue:
1154
  
Inhibitor
Name:
BDBM333136
Synonyms:
(S)-(5-ethyl-2-(6-(2-ethyl-5-fluoro-4-hydroxyphenyl)-1H-indazol-3-yl)-4,5,6,7-tetrahydro-3H-imidazo[4,5-c]pyridin-6-yl)(3-(piperidin-1-yl)azetidin-1-yl)methanone, 2TFA US10550118, Example 8-14 US11453668, Example 8-14
Type:
Small organic molecule
Emp. Form.:
C32H38FN7O2
Mol. Mass.:
571.6882
SMILES:
CCN1Cc2[nH]c(nc2C[C@H]1C(=O)N1CC(C1)N1CCCCC1)-c1n[nH]c2cc(ccc12)-c1cc(F)c(O)cc1CC
: