Target
Fibroblast growth factor receptor 4
Ligand
BDBM333155
Substrate
Meas. Tech.
FGFR-4 wild type assay
IC50
<10±n/a nM
Citation
 Miduturu, CV Inhibitors of the fibroblast growth factor receptor US Patent  US10196436 Publication Date 2/5/2019 
Target
Name:
Fibroblast growth factor receptor 4
Synonyms:
CD_antigen: CD334 FGFR4 FGFR4 Fibroblast growth factor receptor JK2 TKF
Type:
Protein
Mol. Mass.:
87957.45
Organism:
Homo sapiens (Human)
Description:
P22455
Residue:
802
  
Inhibitor
Name:
BDBM333155
Synonyms:
US10196436, Compound 7
Type:
Small organic molecule
Emp. Form.:
C20H17Cl2N3O3
Mol. Mass.:
418.273
SMILES:
COc1cc(OC)c(Cl)c(c1Cl)-c1ccc2nc(ncc2c1)N(C)C(=O)C=C
: