Target
Fibroblast growth factor receptor 4
Ligand
BDBM333159
Substrate
Meas. Tech.
FGFR-4 wild type assay
IC50
550±n/a nM
Citation
 Miduturu, CV Inhibitors of the fibroblast growth factor receptor US Patent  US10196436 Publication Date 2/5/2019 
Target
Name:
Fibroblast growth factor receptor 4
Synonyms:
CD_antigen: CD334 FGFR4 FGFR4 Fibroblast growth factor receptor JK2 TKF
Type:
Protein
Mol. Mass.:
87957.45
Organism:
Homo sapiens (Human)
Description:
P22455
Residue:
802
  
Inhibitor
Name:
BDBM333159
Synonyms:
US10196436, Compound 11
Type:
Small organic molecule
Emp. Form.:
C21H28N6O3S
Mol. Mass.:
444.55
SMILES:
CCCS(=O)(=O)NC1CCCN(C1)c1ccnc(Nc2ccccc2NC(=O)C=C)n1
: