Target
Fibroblast growth factor receptor 4
Ligand
BDBM333200
Substrate
Meas. Tech.
FGFR-4 wild type assay
IC50
55±n/a nM
Citation
 Miduturu, CV Inhibitors of the fibroblast growth factor receptor US Patent  US10196436 Publication Date 2/5/2019 
Target
Name:
Fibroblast growth factor receptor 4
Synonyms:
CD_antigen: CD334 FGFR4 FGFR4 Fibroblast growth factor receptor JK2 TKF
Type:
Protein
Mol. Mass.:
87957.45
Organism:
Homo sapiens (Human)
Description:
P22455
Residue:
802
  
Inhibitor
Name:
BDBM333200
Synonyms:
US10196436, Compound 49A
Type:
Small organic molecule
Emp. Form.:
C25H22Cl2N4O4S
Mol. Mass.:
545.438
SMILES:
COc1cc(OC)c(Cl)c(c1Cl)-c1ccc2nc(Nc3c(C)cccc3NS(=O)(=O)C=C)ncc2c1
: