Target
Adenosine receptor A3
Ligand
BDBM333252
Substrate
Meas. Tech.
Assay for Binding Affinity for Adenosine Receptor A3
Ki
550±n/a nM
Citation
 Lee, JKim, SKim, DAhn, KLee, GKim, DHwang, H Compounds antagonizing A3 adenosine receptor, method for preparing them, and medical-use thereof US Patent  US10196396 Publication Date 2/5/2019 
Target
Name:
Adenosine receptor A3
Synonyms:
A3 adenosine receptor (hA3) ADORA3 | Adenosine A3 receptor (A3AR)
Type:
G Protein-Coupled Receptor (GPCR)
Mol. Mass.:
36197.32
Organism:
Homo sapiens (Human)
Description:
P0DMS8
Residue:
318
  
Inhibitor
Name:
BDBM333252
Synonyms:
(2S,3R,4S)-2-(8-((2-chlorobenzyl)amino)-[1,2,4]triazolo[4,3-a]pyrazin-3-yl)tetrahydrothiophene-3,4-diol | US10196396, Compound 47
Type:
Small organic molecule
Emp. Form.:
C16H16ClN5O2S
Mol. Mass.:
377.849
SMILES:
O[C@@H]1CS[C@H]([C@@H]1O)c1nnc2c(NCc3ccccc3Cl)nccn12
: