Target
MAP kinase-interacting serine/threonine-protein kinase 1
Ligand
BDBM333392
Substrate
Meas. Tech.
Kinase Assay
IC50
24.0±n/a nM
Citation
 Eis, KPühler, FZorn, LScholz, ALienau, PGnoth, MJBömer, UGünther, JFanghänel, JKorr, D Substituted aminoimidazopyridazines US Patent  US9730929 Publication Date 8/15/2017 
Target
Name:
MAP kinase-interacting serine/threonine-protein kinase 1
Synonyms:
MAP Kinase-Interacting Protein Kinase (MNK1) MAP kinase-interacting serine/threonine-protein kinase 1 (MnK1) MAP-kinase interacting kinase 1 (MNK1) MKNK1 MNK1
Type:
Serine/threonine-protein kinase
Mol. Mass.:
51342.85
Organism:
Homo sapiens (Human)
Description:
Q9BUB5
Residue:
465
  
Inhibitor
Name:
BDBM333392
Synonyms:
(+)-2-{[3-(1-Benzofuran-2-yl)imidazo[1,2-b]pyridazin-6-yl](methyl)amino}-1-phenylethanol | US9730929, Example 13
Type:
Small organic molecule
Emp. Form.:
C23H20N4O2
Mol. Mass.:
384.4305
SMILES:
CN(CC(O)c1ccccc1)c1ccc2ncc(-c3cc4ccccc4o3)n2n1
: