Target
MAP kinase-interacting serine/threonine-protein kinase 1
Ligand
BDBM333394
Substrate
Meas. Tech.
Kinase Assay
IC50
10.00±n/a nM
Citation
 Eis, KPühler, FZorn, LScholz, ALienau, PGnoth, MJBömer, UGünther, JFanghänel, JKorr, D Substituted aminoimidazopyridazines US Patent  US9730929 Publication Date 8/15/2017 
Target
Name:
MAP kinase-interacting serine/threonine-protein kinase 1
Synonyms:
MAP Kinase-Interacting Protein Kinase (MNK1) MAP kinase-interacting serine/threonine-protein kinase 1 (MnK1) MAP-kinase interacting kinase 1 (MNK1) MKNK1 MNK1
Type:
Serine/threonine-protein kinase
Mol. Mass.:
51342.85
Organism:
Homo sapiens (Human)
Description:
Q9BUB5
Residue:
465
  
Inhibitor
Name:
BDBM333394
Synonyms:
1-{[3-(4-Methoxyfuro[3,2-c]pyridin-2-yl)imidazo[1,2-b]pyridazin-6-yl](methyl)amino}propan-2-ol | US9730929, Example 15
Type:
Small organic molecule
Emp. Form.:
C19H20N4O3
Mol. Mass.:
352.3871
SMILES:
COc1cccc2oc(cc12)-c1cnc2ccc(nn12)N(C)CC(C)O
: