Target
MAP kinase-interacting serine/threonine-protein kinase 1
Ligand
BDBM214648
Substrate
Meas. Tech.
Kinase Assay
IC50
250±n/a nM
Citation
 Eis, KPühler, FZorn, LScholz, ALienau, PGnoth, MJBömer, UGünther, JFanghänel, JKorr, D Substituted aminoimidazopyridazines US Patent  US9730929 Publication Date 8/15/2017 
Target
Name:
MAP kinase-interacting serine/threonine-protein kinase 1
Synonyms:
MAP Kinase-Interacting Protein Kinase (MNK1) MAP kinase-interacting serine/threonine-protein kinase 1 (MnK1) MAP-kinase interacting kinase 1 (MNK1) MKNK1 MNK1
Type:
Serine/threonine-protein kinase
Mol. Mass.:
51342.85
Organism:
Homo sapiens (Human)
Description:
Q9BUB5
Residue:
465
  
Inhibitor
Name:
BDBM214648
Synonyms:
US9284319, R6 US9783543, R6
Type:
Small organic molecule
Emp. Form.:
C21H17N5O
Mol. Mass.:
355.3926
SMILES:
C(Cc1ccccn1)Nc1ccc2ncc(-c3cc4ccccc4o3)n2n1
: