Target
Coagulation factor IX
Ligand
BDBM12860
Substrate
BDBM12774
Meas. Tech.
Enzyme Assay and Determination of the Inhibition Constants.
pH
7.4±n/a
Temperature
298.15±n/a K
Ki
>41000±n/a nM
Citation
 Li, YLFevig, JMCacciola, JBuriak, JRossi, KAJona, JKnabb, RMLuettgen, JMWong, PCBai, SAWexler, RRLam, PY Preparation of 1-(3-aminobenzo[d]isoxazol-5-yl)-1H-pyrazolo[4,3-d]pyrimidin-7(6H)-ones as potent, selective, and efficacious inhibitors of coagulation factor Xa. Bioorg Med Chem Lett 16:5176-82 (2006)  
Target
Name:
Coagulation factor IX
Synonyms:
Christmas factor Coagulation factor IX/VIII Coagulation factor IXa heavy chain F9 Factor IX Factor IXa (fIXa) Plasma thromboplastin component
Type:
Enzyme
Mol. Mass.:
51768.83
Organism:
Homo sapiens (Human)
Description:
P00740
Residue:
461
  
Inhibitor
Name:
BDBM12860
Synonyms:
1-(3-amino-1,2-benzoxazol-5-yl)-6-(4-{2-[(dimethylamino)methyl]phenyl}phenyl)-3,5-dimethyl-1H,6H,7H-pyrazolo[4,3-d]pyrimidin-7-one | Pyrazolo[4,3-d]pyrimidinone 19f
Type:
Small organic molecule
Emp. Form.:
C29H27N7O2
Mol. Mass.:
505.5704
SMILES:
CN(C)Cc1ccccc1-c1ccc(cc1)-n1c(C)nc2c(C)nn(-c3ccc4onc(N)c4c3)c2c1=O
:
Substrate
Name:
BDBM12774
Synonyms:
(2S)-5-carbamimidamido-2-{2-[(2R)-3-(4-hydroxycyclohexyl)-2-methanesulfonamidopropanamido]acetamido}-N-(4-nitrophenyl)pentanamide; acetic acid Factor IX Chromogenic Substrate Methylsulfonyl-D-hexahydrotyrosyl-glycyl-arginine-4-nitroanilide Spectrozyme tPA | tPA/Trypsin Substrate
Type:
Small organic molecule
Emp. Form.:
C24H38N8O8S
Mol. Mass.:
598.672
SMILES:
CS(=O)(=O)NC(CC1CCC(O)CC1)C(=O)NCC(=O)NC(CCC\[NH+]=C(\N)[NH-])C(=O)Nc1ccc(cc1)[N+]([O-])=O
: