Target
Dimer of Gag-Pol polyprotein [491-589,Q496K]
Ligand
BDBM12878
Substrate
HIV-1 Protease Substrate
Meas. Tech.
Enzyme Inhibition Assay
pH
4.7±n/a
Temperature
303.15±n/a K
Ki
0.004±n/a nM
Citation
 Ali, AReddy, GSCao, HAnjum, SGNalam, MNSchiffer, CARana, TM Discovery of HIV-1 protease inhibitors with picomolar affinities incorporating N-aryl-oxazolidinone-5-carboxamides as novel P2 ligands. J Med Chem 49:7342-56 (2006)  
Target
Name:
Dimer of Gag-Pol polyprotein [491-589,Q496K]
Synonyms:
HIV-1 Protease | HIV-1 Protease (Q7K)
Type:
Protein Complex
Mol. Mass.:
Description:
Components:
This complex has 2 components.
Component 1
Name:
Gag-Pol polyprotein [491-589,Q496K]
Synonyms:
HIV-1 Protease chain A gag-pol
Type:
Enzyme Subunit
Mol. Mass.:
10807.22
Organism:
Human immunodeficiency virus type 1
Description:
P03369[491-589,Q496K]
Residue:
99
  
Component 2
Name:
Gag-Pol polyprotein [491-589,Q496K]
Synonyms:
HIV-1 Protease chain A gag-pol
Type:
Enzyme Subunit
Mol. Mass.:
10807.22
Organism:
Human immunodeficiency virus type 1
Description:
P03369[491-589,Q496K]
Residue:
99
  
Inhibitor
Name:
BDBM12878
Synonyms:
(5S)-3-(4-Acetylphenyl)-N-[(1S,2R)-1-benzyl-2-hydroxy-3-[isobutyl[(4-methoxyphenyl)sulfonyl]amino]propyl]-2-oxooxazolidine-5-carboxamide N-Aryl-oxazolidinone-5-carboxamide Analogue 21f
Type:
Small organic molecule
Emp. Form.:
C33H39N3O8S
Mol. Mass.:
637.743
SMILES:
COc1ccc(cc1)S(=O)(=O)N(CC(C)C)C[C@@H](O)[C@H](Cc1ccccc1)NC(=O)[C@@H]1CN(C(=O)O1)c1ccc(cc1)C(C)=O
:
Substrate
Name:
HIV-1 Protease Substrate
Synonyms:
Type:
Peptide
Mol. Mass.:
4728.18
Organism:
Description:
Residue:
44