Target
Dimer of Gag-Pol polyprotein [491-589,Q498K,L501I,V555I,A562V,G564S,I575V,L581M]
Ligand
BDBM577
Substrate
HIV-1 Protease Substrate
Meas. Tech.
Enzyme Inhibition Assay
Ki
1.4±n/a nM
Citation
 Ali, AReddy, GSCao, HAnjum, SGNalam, MNSchiffer, CARana, TM Discovery of HIV-1 protease inhibitors with picomolar affinities incorporating N-aryl-oxazolidinone-5-carboxamides as novel P2 ligands. J Med Chem 49:7342-56 (2006)  
Target
Name:
Dimer of Gag-Pol polyprotein [491-589,Q498K,L501I,V555I,A562V,G564S,I575V,L581M]
Synonyms:
HIV-1 Protease Mutant M3 (L10I, L63P, A71V, G73S, I84V, L90M)
Type:
Protein Complex
Mol. Mass.:
Description:
Components:
This complex has 2 components.
Component 1
Name:
Gag-Pol polyprotein [491-589,Q498K,L501I,V555I,A562V,G564S,I575V,L581M]
Synonyms:
HIV-1 Protease Mutant M3 (Q7K,L10I, V64I, A71V, G73S, I84V, L90M) chain A POL_HV1A2 | gag-pol
Type:
Enzyme Subunit
Mol. Mass.:
10869.31
Organism:
Human immunodeficiency virus type 1
Description:
O38732 mutant
Residue:
99
  
Component 2
Name:
Gag-Pol polyprotein [491-589,Q498K,L501I,V555I,A562V,G564S,I575V,L581M]
Synonyms:
HIV-1 Protease Mutant M3 (Q7K,L10I, V64I, A71V, G73S, I84V, L90M) chain A POL_HV1A2 | gag-pol
Type:
Enzyme Subunit
Mol. Mass.:
10869.31
Organism:
Human immunodeficiency virus type 1
Description:
O38732 mutant
Residue:
99
  
Inhibitor
Name:
BDBM577
Synonyms:
(3S)-oxolan-3-yl N-[(2S,3R)-4-[(4-aminobenzene)(2-methylpropyl)sulfonamido]-3-hydroxy-1-phenylbutan-2-yl]carbamate APV Amprenavir CHEMBL116 | VX-478
Type:
Small organic molecule
Emp. Form.:
C25H35N3O6S
Mol. Mass.:
505.627
SMILES:
CC(C)CN(C[C@@H](O)[C@H](Cc1ccccc1)NC(=O)O[C@H]1CCOC1)S(=O)(=O)c1ccc(N)cc1
:
Substrate
Name:
HIV-1 Protease Substrate
Synonyms:
Type:
Peptide
Mol. Mass.:
4728.18
Organism:
Description:
Residue:
44