Target
Fibroblast growth factor receptor 1
Ligand
BDBM249402
Substrate
Meas. Tech.
Kinase HotSpots Assay
IC50
>20000±n/a nM
Citation
 Reynolds, DHao, MWang, JPrajapati, SSatoh, TSelvaraj, A Pyrimidine FGFR4 inhibitors US Patent  US9730931 Publication Date 8/15/2017 
Target
Name:
Fibroblast growth factor receptor 1
Synonyms:
BFGFR Basic fibroblast growth factor receptor 1 (FGFR1) CEK FGFR-1 FGFR-1, (FL) FGFR1_HUMAN FLT2 Fibroblast growth factor receptor 1 (FGFR-1) Fms-like tyrosine kinase 2 N-sam bFGF-R | c-fgr
Type:
Receptor
Mol. Mass.:
91861.70
Organism:
Homo sapiens (Human)
Description:
P11362
Residue:
822
  
Inhibitor
Name:
BDBM249402
Synonyms:
US10537571, Compound 116 US9434697, 116 | US9730931, Compound 116
Type:
Small organic molecule
Emp. Form.:
C25H26Cl2N6O5
Mol. Mass.:
561.417
SMILES:
COCCN(C(=O)Nc1c(Cl)c(OC)cc(OC)c1Cl)c1cc(Nc2ccccc2NC(=O)C=C)ncn1
: