Target
Fibroblast growth factor receptor 1
Ligand
BDBM249413
Substrate
Meas. Tech.
Kinase HotSpots Assay
IC50
>10000±n/a nM
Citation
 Reynolds, DHao, MWang, JPrajapati, SSatoh, TSelvaraj, A Pyrimidine FGFR4 inhibitors US Patent  US9730931 Publication Date 8/15/2017 
Target
Name:
Fibroblast growth factor receptor 1
Synonyms:
BFGFR Basic fibroblast growth factor receptor 1 (FGFR1) CEK FGFR-1 FGFR-1, (FL) FGFR1_HUMAN FLT2 Fibroblast growth factor receptor 1 (FGFR-1) Fms-like tyrosine kinase 2 N-sam bFGF-R | c-fgr
Type:
Receptor
Mol. Mass.:
91861.70
Organism:
Homo sapiens (Human)
Description:
P11362
Residue:
822
  
Inhibitor
Name:
BDBM249413
Synonyms:
US10537571, Compound 130 US9434697, 130 | US9730931, Compound 130
Type:
Small organic molecule
Emp. Form.:
C29H26Cl2N6O4
Mol. Mass.:
593.461
SMILES:
COc1cc(OC)c(Cl)c(NC(=O)N(Cc2ccccc2)c2cc(Nc3ccccc3NC(=O)C=C)ncn2)c1Cl
: