Target
Fibroblast growth factor receptor 4
Ligand
BDBM249420
Substrate
Meas. Tech.
Binding Assay
IC50
6.00±n/a nM
Citation
 Reynolds, DHao, MWang, JPrajapati, SSatoh, TSelvaraj, A Pyrimidine FGFR4 inhibitors US Patent  US9730931 Publication Date 8/15/2017 
Target
Name:
Fibroblast growth factor receptor 4
Synonyms:
CD_antigen: CD334 FGFR4 FGFR4 Fibroblast growth factor receptor JK2 TKF
Type:
Protein
Mol. Mass.:
87957.45
Organism:
Homo sapiens (Human)
Description:
P22455
Residue:
802
  
Inhibitor
Name:
BDBM249420
Synonyms:
US10537571, Compound 139 US9434697, 139 | US9730931, Compound 139
Type:
Small organic molecule
Emp. Form.:
C29H36N8O4
Mol. Mass.:
560.6473
SMILES:
CCN1CCN(CC1)c1ccc(Nc2cc(ncn2)N(C)C(=O)Nc2cc(OC)cc(OC)c2)c(NC(=O)C=C)c1
: