Target
Fibroblast growth factor receptor 1
Ligand
BDBM249391
Substrate
Meas. Tech.
Kinase HotSpots Assay
IC50
>10100±n/a nM
Citation
 Reynolds, DHao, MWang, JPrajapati, SSatoh, TSelvaraj, A Pyrimidine FGFR4 inhibitors US Patent  US9730931 Publication Date 8/15/2017 
Target
Name:
Fibroblast growth factor receptor 1
Synonyms:
BFGFR Basic fibroblast growth factor receptor 1 (FGFR1) CEK FGFR-1 FGFR-1, (FL) FGFR1_HUMAN FLT2 Fibroblast growth factor receptor 1 (FGFR-1) Fms-like tyrosine kinase 2 N-sam bFGF-R | c-fgr
Type:
Receptor
Mol. Mass.:
91861.70
Organism:
Homo sapiens (Human)
Description:
P11362
Residue:
822
  
Inhibitor
Name:
BDBM249391
Synonyms:
US10537571, Compound 100 US9434697, 100 | US9730931, Compound 100
Type:
Small organic molecule
Emp. Form.:
C23H22Cl2N6O4
Mol. Mass.:
517.365
SMILES:
COc1cc(OC)c(Cl)c(NC(=O)N(C)c2cc(Nc3ccccc3NC(=O)C=C)ncn2)c1Cl
: