Target
Fibroblast growth factor receptor 4
Ligand
BDBM249391
Substrate
Meas. Tech.
Binding Assay
IC50
<1.000±n/a nM
Citation
 Reynolds, DHao, MWang, JPrajapati, SSatoh, TSelvaraj, A Pyrimidine FGFR4 inhibitors US Patent  US9730931 Publication Date 8/15/2017 
Target
Name:
Fibroblast growth factor receptor 4
Synonyms:
CD_antigen: CD334 FGFR4 FGFR4 Fibroblast growth factor receptor JK2 TKF
Type:
Protein
Mol. Mass.:
87957.45
Organism:
Homo sapiens (Human)
Description:
P22455
Residue:
802
  
Inhibitor
Name:
BDBM249391
Synonyms:
US10537571, Compound 100 US9434697, 100 | US9730931, Compound 100
Type:
Small organic molecule
Emp. Form.:
C23H22Cl2N6O4
Mol. Mass.:
517.365
SMILES:
COc1cc(OC)c(Cl)c(NC(=O)N(C)c2cc(Nc3ccccc3NC(=O)C=C)ncn2)c1Cl
: