Target
Serine/threonine-protein kinase B-raf
Ligand
BDBM333541
Substrate
Meas. Tech.
Competition Binding Assay
Kd
375±n/a nM
Citation
 Abraham, SBhagwat, SSCampbell, BTChao, QFaraoni, RHolladay, MWLai, AGRowbottom, MWSetti, ESprankle, KG RAF kinase modulator compounds and methods of use thereof US Patent  US9730937 Publication Date 8/15/2017 
Target
Name:
Serine/threonine-protein kinase B-raf
Synonyms:
B-RAF B-Raf proto-oncogene serine/threonine-protein kinase BRAF1 RAFB1 v-Raf murine sarcoma viral oncogene homolog B1
Type:
Serine/threonine-protein kinase
Mol. Mass.:
84446.00
Organism:
Homo sapiens (Human)
Description:
P15056
Residue:
766
  
Inhibitor
Name:
BDBM333541
Synonyms:
1-(5-tert- butylisoxazol- 3-yl)-3-(3- (7-(2-(4-(2- hydroxyethyl) piperazin-1- yl)ethoxy)-6- methoxy- quinazolin- 4- ylthio)phenyl) urea | US9730937, Example 84
Type:
Small organic molecule
Emp. Form.:
C32H40N6O5S
Mol. Mass.:
620.762
SMILES:
COc1cc2c(Sc3cccc(NC(=O)Nc4cc(on4)C(C)(C)C)c3)ncnc2cc1OCCN1CCC(CCO)CC1
: