Target
Carbonic anhydrase 1
Ligand
BDBM12937
Substrate
BDBM10856
Meas. Tech.
CA Inhibition Assay
Ki
9.6±n/a nM
Citation
 Wilkinson, BLBornaghi, LFHouston, TAInnocenti, ASupuran, CTPoulsen, SA A novel class of carbonic anhydrase inhibitors: glycoconjugate benzene sulfonamides prepared by "click-tailing". J Med Chem 49:6539-48 (2006)  
Target
Name:
Carbonic anhydrase 1
Synonyms:
CA-I CAB Carbonate dehydratase I Carbonic anhydrase 1 (CA I) Carbonic anhydrase 1 (Recombinant CA I) Carbonic anhydrase B Carbonic anhydrase I (CA I) Carbonic anhydrase I (CAI) Carbonic anhydrase isoenzyme I (hCA I) | hCA
Type:
Enzyme
Mol. Mass.:
28873.37
Organism:
Homo sapiens (Human)
Description:
P00915
Residue:
261
  
Inhibitor
Name:
BDBM12937
Synonyms:
4-({[4-(Aminosulfonyl)benzoyl]oxy}methyl-1-(beta-D-glucuronic acid methyl ester)-1H-1,2,3-triazole Glycoconjugate Benzene Sulfonamide 3ee | methyl (2S,3S,4S,5R,6R)-3,4,5-trihydroxy-6-(4-{[(4-sulfamoylphenyl)carbonyloxy]methyl}-1H-1,2,3-triazol-1-yl)oxane-2-carboxylate
Type:
Small organic molecule
Emp. Form.:
C17H20N4O10S
Mol. Mass.:
472.427
SMILES:
COC(=O)[C@H]1O[C@H]([C@H](O)[C@@H](O)[C@@H]1O)n1cc(COC(=O)c2ccc(cc2)S(N)(=O)=O)nn1
:
Substrate
Name:
BDBM10856
Synonyms:
Carbon Dioxide | methanedione
Type:
Small organic molecule
Emp. Form.:
CO2
Mol. Mass.:
44.0095
SMILES:
O=C=O
: