Target
Toll-like receptor 2
Ligand
BDBM50386535
Substrate
Meas. Tech.
Reporter Gene Assay
EC50
4450±n/a nM
Citation
 Salunke, DBGuo, XDavid, SA Toll-like receptor 2-agonistic lipopeptides, and method of making the same US Patent  US9676818 Publication Date 6/13/2017 
Target
Name:
Toll-like receptor 2
Synonyms:
TIL4 TLR2_HUMAN Toll-like receptor 2 (TLR2)
Type:
Protein
Mol. Mass.:
89837.58
Organism:
Homo sapiens (Human)
Description:
O60603
Residue:
784
  
Inhibitor
Name:
BDBM50386535
Synonyms:
CHEMBL2048219 | US9676818, 11h
Type:
Small organic molecule
Emp. Form.:
C27H47F3N2O7S
Mol. Mass.:
600.731
SMILES:
CCCCCCCCCCCCCCCC(=O)OCCSC[C@H](NC(=O)C(F)(F)F)C(=O)N[C@@H](CO)C(=O)OC
: