Target
Toll-like receptor 2
Ligand
BDBM199112
Substrate
Meas. Tech.
Reporter Gene Assay
EC50
225±n/a nM
Citation
 Salunke, DBGuo, XDavid, SA Toll-like receptor 2-agonistic lipopeptides, and method of making the same US Patent  US9676818 Publication Date 6/13/2017 
Target
Name:
Toll-like receptor 2
Synonyms:
TIL4 TLR2_HUMAN Toll-like receptor 2 (TLR2)
Type:
Protein
Mol. Mass.:
89837.58
Organism:
Homo sapiens (Human)
Description:
O60603
Residue:
784
  
Inhibitor
Name:
BDBM199112
Synonyms:
US9676818, 23
Type:
Small organic molecule
Emp. Form.:
C30H57N3O6S
Mol. Mass.:
587.855
SMILES:
CCCCCCCCCCCCCCCC(=O)OCCSC[C@H](NC(C)=O)C(=O)N[C@@H](CCCCN)C(=O)OC
: