Target
Phosphatidylinositol 4,5-bisphosphate 3-kinase catalytic subunit delta isoform
Ligand
BDBM255830
Substrate
Meas. Tech.
Scintillation Proximity Assay
IC50
125±n/a nM
Citation
 Li, YYao, WCombs, APYue, EWMei, SZhu, WGlenn, JMaduskuie, Jr., TPSparks, RBDouty, BHe, C Heterocyclylamines as PI3K inhibitors US Patent  US9730939 Publication Date 8/15/2017 
Target
Name:
Phosphatidylinositol 4,5-bisphosphate 3-kinase catalytic subunit delta isoform
Synonyms:
PI3-kinase p110 subunit delta PI3-kinase subunit p110-delta PIK3CD Phosphatidylinositol 4,5-biphosphate 3-kinase catalytic subunit delta (PIK3CD) Phosphatidylinositol 4,5-bisphosphate 3-kinase 110 kDa catalytic subunit delta (PI3K delta) Phosphatidylinositol 4,5-bisphosphate 3-kinase catalytic subunit delta (PI3Kdelta) Phosphatidylinositol 4,5-bisphosphate 3-kinase catalytic subunit delta isoform (PI3K delta) Phosphatidylinositol 4,5-bisphosphate 3-kinase catalytic subunit delta isoform (PI3K-delta) Phosphatidylinositol 4,5-bisphosphate 3-kinase catalytic subunit delta isoform (PI3Kdelta)
Type:
Enzyme Subunit
Mol. Mass.:
119489.41
Organism:
Homo sapiens (Human)
Description:
O00329
Residue:
1044
  
Inhibitor
Name:
BDBM255830
Synonyms:
4-{3-[1-(4-amino-1H-pyrazolo[3,4-d]pyrimidin-1-yl)ethyl]-5-chloro-2-methoxy-6-methylphenyl}-N-(2-hydroxyethyl)pyridine-2-carboxamide US10376513, Example 39 US11433071, Example 39 US9730939, Example 39
Type:
Small organic molecule
Emp. Form.:
C23H24ClN7O3
Mol. Mass.:
481.935
SMILES:
COc1c(cc(Cl)c(C)c1-c1ccnc(c1)C(=O)NCCO)C(C)n1ncc2c(N)ncnc12
: