Target
Phosphatidylinositol 4,5-bisphosphate 3-kinase catalytic subunit delta isoform
Ligand
BDBM261257
Substrate
Meas. Tech.
Scintillation Proximity Assay
IC50
<10±n/a nM
Citation
 Li, YYao, WCombs, APYue, EWMei, SZhu, WGlenn, JMaduskuie, Jr., TPSparks, RBDouty, BHe, C Heterocyclylamines as PI3K inhibitors US Patent  US9730939 Publication Date 8/15/2017 
Target
Name:
Phosphatidylinositol 4,5-bisphosphate 3-kinase catalytic subunit delta isoform
Synonyms:
PI3-kinase p110 subunit delta PI3-kinase subunit p110-delta PIK3CD Phosphatidylinositol 4,5-biphosphate 3-kinase catalytic subunit delta (PIK3CD) Phosphatidylinositol 4,5-bisphosphate 3-kinase 110 kDa catalytic subunit delta (PI3K delta) Phosphatidylinositol 4,5-bisphosphate 3-kinase catalytic subunit delta (PI3Kdelta) Phosphatidylinositol 4,5-bisphosphate 3-kinase catalytic subunit delta isoform (PI3K delta) Phosphatidylinositol 4,5-bisphosphate 3-kinase catalytic subunit delta isoform (PI3K-delta) Phosphatidylinositol 4,5-bisphosphate 3-kinase catalytic subunit delta isoform (PI3Kdelta)
Type:
Enzyme Subunit
Mol. Mass.:
119489.41
Organism:
Homo sapiens (Human)
Description:
O00329
Residue:
1044
  
Inhibitor
Name:
BDBM261257
Synonyms:
US10092570, Example 280 US10646492, Example 280 US9730939, Example 280
Type:
Small organic molecule
Emp. Form.:
C25H30ClN7O2
Mol. Mass.:
496.004
SMILES:
COc1c(cc(Cl)c(C#N)c1C1CN(CC2CCOCC2)C1)C(C)n1nc(C)c2c(N)ncnc12
: