Target
Phosphatidylinositol 4,5-bisphosphate 3-kinase catalytic subunit delta isoform
Ligand
BDBM334157
Substrate
Meas. Tech.
Biochemical Assay
IC50
28.0±n/a nM
Citation
 Achab, AAAltman, MDDeng, YGuzi, TKattar, SKatz, JDMethot, JLZhou, HMcGowan, MChristopher, MPGarcia, YAnthony, NJFradera Llinas, FXFong, KCLeng, XMu, CZhang, SZhang, R Purine inhibitors of human phosphatidylinositol 3-kinase delta US Patent  US9730940 Publication Date 8/15/2017 
Target
Name:
Phosphatidylinositol 4,5-bisphosphate 3-kinase catalytic subunit delta isoform
Synonyms:
PI3-kinase p110 subunit delta PI3-kinase subunit p110-delta PIK3CD Phosphatidylinositol 4,5-biphosphate 3-kinase catalytic subunit delta (PIK3CD) Phosphatidylinositol 4,5-bisphosphate 3-kinase 110 kDa catalytic subunit delta (PI3K delta) Phosphatidylinositol 4,5-bisphosphate 3-kinase catalytic subunit delta (PI3Kdelta) Phosphatidylinositol 4,5-bisphosphate 3-kinase catalytic subunit delta isoform (PI3K delta) Phosphatidylinositol 4,5-bisphosphate 3-kinase catalytic subunit delta isoform (PI3K-delta) Phosphatidylinositol 4,5-bisphosphate 3-kinase catalytic subunit delta isoform (PI3Kdelta)
Type:
Enzyme Subunit
Mol. Mass.:
119489.41
Organism:
Homo sapiens (Human)
Description:
O00329
Residue:
1044
  
Inhibitor
Name:
BDBM334157
Synonyms:
(3S)-N-cyclopropyl-3-{[9-ethyl- 8-(2-methylpyrimidin-5-yl)-9H- purin-6-yl]oxy}-N- methylpyrrolidine-1- carboxamide | US9730940, Compound 5-10
Type:
Small organic molecule
Emp. Form.:
C21H26N8O2
Mol. Mass.:
422.4835
SMILES:
CCn1c(nc2c(O[C@H]3CCN(C3)C(=O)N(C)C3CC3)ncnc12)-c1cnc(C)nc1
: