Target
Nitric oxide synthase, inducible
Ligand
BDBM50446247
Substrate
Meas. Tech.
Inhibition Assay
Ki
13564±n/a nM
Citation
 Silverman, RBJing, Q 2-aminopyridine-based selective neuronal nitric oxide synthase inhibitors US Patent  US9732037 Publication Date 8/15/2017 
Target
Name:
Nitric oxide synthase, inducible
Synonyms:
HEP-NOS Inducible NO synthase NOS type II NOS2A Nitric oxide synthase, inducible (iNOS) | iNOS
Type:
Homodimer
Mol. Mass.:
131141.95
Organism:
Homo sapiens (Human)
Description:
P35228
Residue:
1153
  
Inhibitor
Name:
BDBM50446247
Synonyms:
CHEMBL3109191 | US9732037, Compound 11
Type:
Small organic molecule
Emp. Form.:
C21H31N5O3
Mol. Mass.:
401.5025
SMILES:
Cc1cc(N)nc(COCCOC[C@H]2C[C@H](CN2)OCc2cc(C)cc(N)n2)c1
: