Target
Nitric oxide synthase, inducible
Ligand
BDBM50441011
Substrate
Meas. Tech.
Inhibition Assay
Ki
7808±n/a nM
Citation
 Silverman, RBJing, Q 2-aminopyridine-based selective neuronal nitric oxide synthase inhibitors US Patent  US9732037 Publication Date 8/15/2017 
Target
Name:
Nitric oxide synthase, inducible
Synonyms:
HEP-NOS Inducible NO synthase NOS type II NOS2A Nitric oxide synthase, inducible (iNOS) | iNOS
Type:
Homodimer
Mol. Mass.:
131141.95
Organism:
Homo sapiens (Human)
Description:
P35228
Residue:
1153
  
Inhibitor
Name:
BDBM50441011
Synonyms:
CHEMBL2430144 | US9732037, Compound 15
Type:
Small organic molecule
Emp. Form.:
C17H25N5O2
Mol. Mass.:
331.4127
SMILES:
Cc1cc(N)nc(COC[C@@H](CN)OCc2cc(C)cc(N)n2)c1
: