Target
Coagulation factor XI
Ligand
BDBM12952
Substrate
BDBM12947
Meas. Tech.
Enzyme Inhibition Assay
pH
7.4±n/a
Temperature
303.15±n/a K
IC50
2200±n/a nM
Citation
 Lin, JDeng, HJin, LPandey, PQuinn, JCantin, SRynkiewicz, MJGorga, JCBibbins, FCelatka, CANagafuji, PBannister, TDMeyers, HVBabine, REHayward, NJWeaver, DBenjamin, HStassen, FAbdel-Meguid, SSStrickler, JE Design, synthesis, and biological evaluation of peptidomimetic inhibitors of factor XIa as novel anticoagulants. J Med Chem 49:7781-91 (2006)  
Target
Name:
Coagulation factor XI
Synonyms:
Coagulation factor XIa Coagulation factor XIa light chain FA11_HUMAN Factor XIa PTA | Plasma thromboplastin antecedent
Type:
Enzyme
Mol. Mass.:
70130.58
Organism:
Homo sapiens (Human)
Description:
P03951
Residue:
625
  
Inhibitor
Name:
BDBM12952
Synonyms:
(2S)-N-[(2S)-5-carbamimidamido-1-oxo-1-(1,3-thiazol-2-yl)pentan-2-yl]-2-[(2S)-2-(furan-2-ylformamido)-3-phenylpropanamido]-3-methylbutanamide | alpha-ketothiazole analogue 12
Type:
Small organic molecule
Emp. Form.:
C28H35N7O5S
Mol. Mass.:
581.686
SMILES:
[#6]-[#6](-[#6])-[#6@H](-[#7]-[#6](=O)-[#6@H](-[#6]-c1ccccc1)-[#7]-[#6](=O)-c1ccco1)-[#6](=O)-[#7]-[#6@@H](-[#6]-[#6]-[#6]\[#7]=[#6](/[#7])-[#7])-[#6](=O)-c1nccs1
:
Substrate
Name:
BDBM12947
Synonyms:
(2S)-5-carbamimidamido-N-(4-methyl-2-oxo-2H-chromen-7-yl)-2-{[(2S)-1-{[(2S)-5-oxopyrrolidin-2-yl]carbonyl}pyrrolidin-2-yl]formamido}pentanamide Glp-Pro-Arg-AMC
Type:
Small organic molecule
Emp. Form.:
C26H33N7O6
Mol. Mass.:
539.5835
SMILES:
[#6]-c1cc(=O)oc2cc(-[#7]-[#6](=O)-[#6@H](-[#6]-[#6]-[#6]\[#7]=[#6](/[#7])-[#7])-[#7]-[#6](=O)-[#6@@H]-3-[#6]-[#6]-[#6]-[#7]-3-[#6](=O)-[#6@@H]-3-[#6]-[#6]-[#6](=O)-[#7]-3)ccc12
: