Target
Coagulation factor XI
Ligand
BDBM12977
Substrate
BDBM12947
Meas. Tech.
Enzyme Inhibition Assay
IC50
12±n/a nM
Citation
 Lin, JDeng, HJin, LPandey, PQuinn, JCantin, SRynkiewicz, MJGorga, JCBibbins, FCelatka, CANagafuji, PBannister, TDMeyers, HVBabine, REHayward, NJWeaver, DBenjamin, HStassen, FAbdel-Meguid, SSStrickler, JE Design, synthesis, and biological evaluation of peptidomimetic inhibitors of factor XIa as novel anticoagulants. J Med Chem 49:7781-91 (2006)  
Target
Name:
Coagulation factor XI
Synonyms:
Coagulation factor XIa Coagulation factor XIa light chain FA11_HUMAN Factor XIa PTA | Plasma thromboplastin antecedent
Type:
Enzyme
Mol. Mass.:
70130.58
Organism:
Homo sapiens (Human)
Description:
P03951
Residue:
625
  
Inhibitor
Name:
BDBM12977
Synonyms:
(2S)-2-[(2S)-2-({[(1R)-1-(4-bromophenyl)ethyl]carbamoyl}amino)-3-(pyridin-3-yl)propanamido]-N-[(2S)-5-carbamimidamido-1-oxo-1-(1,3-thiazol-2-yl)pentan-2-yl]-3-methylbutanamide | alpha-ketothiazole analogue 37
Type:
Small organic molecule
Emp. Form.:
C31H40BrN9O4S
Mol. Mass.:
714.676
SMILES:
[#6]-[#6](-[#6])-[#6@H](-[#7]-[#6](=O)-[#6@H](-[#6]-c1cccnc1)-[#7]-[#6](=O)-[#7]-[#6@H](-[#6])-c1ccc(Br)cc1)-[#6](=O)-[#7]-[#6@@H](-[#6]-[#6]-[#6]\[#7]=[#6](/[#7])-[#7])-[#6](=O)-c1nccs1
:
Substrate
Name:
BDBM12947
Synonyms:
(2S)-5-carbamimidamido-N-(4-methyl-2-oxo-2H-chromen-7-yl)-2-{[(2S)-1-{[(2S)-5-oxopyrrolidin-2-yl]carbonyl}pyrrolidin-2-yl]formamido}pentanamide Glp-Pro-Arg-AMC
Type:
Small organic molecule
Emp. Form.:
C26H33N7O6
Mol. Mass.:
539.5835
SMILES:
[#6]-c1cc(=O)oc2cc(-[#7]-[#6](=O)-[#6@H](-[#6]-[#6]-[#6]\[#7]=[#6](/[#7])-[#7])-[#7]-[#6](=O)-[#6@@H]-3-[#6]-[#6]-[#6]-[#7]-3-[#6](=O)-[#6@@H]-3-[#6]-[#6]-[#6](=O)-[#7]-3)ccc12
: