Target
Prothrombin
Ligand
BDBM12971
Substrate
BDBM12947
Meas. Tech.
Enzyme Inhibition Assay
IC50
606±n/a nM
Citation
 Lin, JDeng, HJin, LPandey, PQuinn, JCantin, SRynkiewicz, MJGorga, JCBibbins, FCelatka, CANagafuji, PBannister, TDMeyers, HVBabine, REHayward, NJWeaver, DBenjamin, HStassen, FAbdel-Meguid, SSStrickler, JE Design, synthesis, and biological evaluation of peptidomimetic inhibitors of factor XIa as novel anticoagulants. J Med Chem 49:7781-91 (2006)  
Target
Name:
Prothrombin
Synonyms:
Activation peptide fragment 1 Coagulation factor II Prothrombin precursor Thrombin heavy chain | Thrombin light chain
Type:
Protein
Mol. Mass.:
70029.57
Organism:
Homo sapiens (Human)
Description:
P00734
Residue:
622
  
Inhibitor
Name:
BDBM12971
Synonyms:
(2S)-N-[(2S)-5-carbamimidamido-1-oxo-1-(1,3-thiazol-2-yl)pentan-2-yl]-2-[(2S)-2-({[(1S)-1-(4-fluorophenyl)ethyl]carbamoyl}amino)-3-(pyridin-3-yl)propanamido]-3-methylbutanamide | alpha-ketothiazole analogue 31
Type:
Small organic molecule
Emp. Form.:
C31H40FN9O4S
Mol. Mass.:
653.771
SMILES:
[#6]-[#6](-[#6])-[#6@H](-[#7]-[#6](=O)-[#6@H](-[#6]-c1cccnc1)-[#7]-[#6](=O)-[#7]-[#6@@H](-[#6])-c1ccc(F)cc1)-[#6](=O)-[#7]-[#6@@H](-[#6]-[#6]-[#6]\[#7]=[#6](/[#7])-[#7])-[#6](=O)-c1nccs1
:
Substrate
Name:
BDBM12947
Synonyms:
(2S)-5-carbamimidamido-N-(4-methyl-2-oxo-2H-chromen-7-yl)-2-{[(2S)-1-{[(2S)-5-oxopyrrolidin-2-yl]carbonyl}pyrrolidin-2-yl]formamido}pentanamide Glp-Pro-Arg-AMC
Type:
Small organic molecule
Emp. Form.:
C26H33N7O6
Mol. Mass.:
539.5835
SMILES:
[#6]-c1cc(=O)oc2cc(-[#7]-[#6](=O)-[#6@H](-[#6]-[#6]-[#6]\[#7]=[#6](/[#7])-[#7])-[#7]-[#6](=O)-[#6@@H]-3-[#6]-[#6]-[#6]-[#7]-3-[#6](=O)-[#6@@H]-3-[#6]-[#6]-[#6](=O)-[#7]-3)ccc12
: