Target
Cannabinoid receptor 2
Ligand
BDBM334286
Substrate
Meas. Tech.
In Vitro Assay
EC50
>10000±n/a nM
Citation
 Macielag, MJZhang, YDeCorte, BLGreco, MNLudovici, DWParker, MH Cinnoline derivatives useful as CB-1 receptor inverse agonists US Patent  US9732061 Publication Date 8/15/2017 
Target
Name:
Cannabinoid receptor 2
Synonyms:
CANNABINOID CB2 CB2 CB2B CNR2_HUMAN Cannabinoid CB2 receptor Cannabinoid receptor 2 (CB2R) | hCB2
Type:
G Protein-Coupled Receptor (GPCR)
Mol. Mass.:
39690.94
Organism:
Homo sapiens (Human)
Description:
P34972
Residue:
360
  
Inhibitor
Name:
BDBM334286
Synonyms:
US9732061, Compound 8
Type:
Small organic molecule
Emp. Form.:
C29H20Cl2F3N3
Mol. Mass.:
538.39
SMILES:
FC(F)(F)c1cccc(CNc2cnnc3ccc(cc23)C(c2ccc(Cl)cc2)c2ccc(Cl)cc2)c1
: