Target
Cannabinoid receptor 1
Ligand
BDBM334305
Substrate
Meas. Tech.
In Vitro Assay
EC50
272±n/a nM
Citation
 Macielag, MJZhang, YDeCorte, BLGreco, MNLudovici, DWParker, MH Cinnoline derivatives useful as CB-1 receptor inverse agonists US Patent  US9732061 Publication Date 8/15/2017 
Target
Name:
Cannabinoid receptor 1
Synonyms:
CANN6 CB-R CNR CNR1_HUMAN Cannabinoid receptor Cannabinoid receptor 1 (brain)
Type:
G Protein-Coupled Receptor (GPCR)
Mol. Mass.:
52868.96
Organism:
Homo sapiens (Human)
Description:
P21554
Residue:
472
  
Inhibitor
Name:
BDBM334305
Synonyms:
US9732061, Compound 27
Type:
Small organic molecule
Emp. Form.:
C31H26Cl2N4O2S
Mol. Mass.:
589.535
SMILES:
Clc1ccc(cc1)C(c1ccc(Cl)cc1)c1ccc2nncc(NC3CCN(C3)S(=O)(=O)c3ccccc3)c2c1
: