Target
Cannabinoid receptor 1
Ligand
BDBM334313
Substrate
Meas. Tech.
In Vitro Assay
EC50
11.0±n/a nM
Citation
 Macielag, MJZhang, YDeCorte, BLGreco, MNLudovici, DWParker, MH Cinnoline derivatives useful as CB-1 receptor inverse agonists US Patent  US9732061 Publication Date 8/15/2017 
Target
Name:
Cannabinoid receptor 1
Synonyms:
CANN6 CB-R CNR CNR1_HUMAN Cannabinoid receptor Cannabinoid receptor 1 (brain)
Type:
G Protein-Coupled Receptor (GPCR)
Mol. Mass.:
52868.96
Organism:
Homo sapiens (Human)
Description:
P21554
Residue:
472
  
Inhibitor
Name:
BDBM334313
Synonyms:
US9732061, Compound 35
Type:
Small organic molecule
Emp. Form.:
C28H26ClF3N4O3S
Mol. Mass.:
591.044
SMILES:
COc1ccc(cc1)C(c1ccc(Cl)cc1)c1ccc2nncc(NC3CCN(CC3)S(=O)(=O)C(F)(F)F)c2c1
: