Target
Mitogen-activated protein kinase 12
Ligand
BDBM334317
Substrate
Meas. Tech.
Enzyme Inhibition Assay
IC50
316±n/a nM
Citation
 Frickel, FFyfe, MCMeghani, PThom, SM Kinase inhibitors US Patent  US9732063 Publication Date 8/15/2017 
Target
Name:
Mitogen-activated protein kinase 12
Synonyms:
ERK6 MAPK12 Mitogen-activated protein kinase 12 (MAPK12 p38 gamma) Mitogen-activated protein kinase 12 Gamma SAPK3 | p38 delta/gamma
Type:
Protein
Mol. Mass.:
41938.69
Organism:
Homo sapiens (Human)
Description:
P53778
Residue:
367
  
Inhibitor
Name:
BDBM334317
Synonyms:
1-(3-(tert-Butyl)-1-(6-methoxypyridin-3-yl)-1H-pyrazol-5-yl)-3-(4-((2-((3-ethynylphenyl)-amino)pyrimidin-4-yl)oxy)naphthalen-1-yl)urea | US9732063, Example 1
Type:
Small organic molecule
Emp. Form.:
C35H31N9O3
Mol. Mass.:
625.6791
SMILES:
COc1ccc(cn1)-n1nc(cc1NC(=O)Nc1ccc(Oc2ccnc(Nc3cccc(c3)C#N)n2)c2ccccc12)C(C)(C)C
: