Target
Proto-oncogene tyrosine-protein kinase Src
Ligand
BDBM334318
Substrate
Meas. Tech.
Enzyme Inhibition Assay
IC50
8.00±n/a nM
Citation
 Frickel, FFyfe, MCMeghani, PThom, SM Kinase inhibitors US Patent  US9732063 Publication Date 8/15/2017 
Target
Name:
Proto-oncogene tyrosine-protein kinase Src
Synonyms:
Calmodulin/Proto-oncogene tyrosine-protein kinase Src Proto-oncogene c-Src SRC SRC_HUMAN V-src sarcoma (Schmidt-Ruppin A-2) viral oncogene homolog (avian) p60-Src | pp60c-src
Type:
Protein
Mol. Mass.:
59838.60
Organism:
Homo sapiens (Human)
Description:
P12931
Residue:
536
  
Inhibitor
Name:
BDBM334318
Synonyms:
S,S-Dimethyl-N-(4-((4-((4-(3-(3-(tert-butyl)-1-(6-methoxypyridin-3-yl)-1H-pyrazol-5-yl)-ureido)naphthalen-1-yl)oxy)pyrimidin-2-yl)amino)phenyl sulfoximine | US9732063, Example 2
Type:
Small organic molecule
Emp. Form.:
C36H37N9O4S
Mol. Mass.:
691.802
SMILES:
COc1ccc(cn1)-n1nc(cc1NC(=O)Nc1ccc(Oc2ccnc(Nc3cccc(c3)N=S(C)(C)=O)n2)c2ccccc12)C(C)(C)C
: