Target
Glycogen synthase kinase-3 alpha
Ligand
BDBM334321
Substrate
Meas. Tech.
Enzyme Inhibition Assay
IC50
306±n/a nM
Citation
 Frickel, FFyfe, MCMeghani, PThom, SM Kinase inhibitors US Patent  US9732063 Publication Date 8/15/2017 
Target
Name:
Glycogen synthase kinase-3 alpha
Synonyms:
GSK-3 alpha GSK3A_HUMAN Glycogen synthase kinase-3 Glycogen synthase kinase-3 alpha (GSK3 Alpha) Glycogen synthase kinase-3 alpha (GSK3alpha)
Type:
Enzyme
Mol. Mass.:
50991.79
Organism:
Homo sapiens (Human)
Description:
P49840
Residue:
483
  
Inhibitor
Name:
BDBM334321
Synonyms:
3-(4-((4-(3-(3-(tert-Butyl)-1-(6-methoxypyridin-3-yl)-1H-pyrazol-5-yl)ureido)naphthalen-1-yl)oxy)pyrimidin-2-yl)amino)phenyl carbamate | US9732063, Example 5
Type:
Small organic molecule
Emp. Form.:
C35H33N9O5
Mol. Mass.:
659.6938
SMILES:
COc1ccc(cn1)-n1nc(cc1NC(=O)Nc1ccc(Oc2ccnc(Nc3cccc(OC(N)=O)c3)n2)c2ccccc12)C(C)(C)C
: