Target
Glycogen synthase kinase-3 alpha
Ligand
BDBM334327
Substrate
Meas. Tech.
Enzyme Inhibition Assay
IC50
8651±n/a nM
Citation
 Frickel, FFyfe, MCMeghani, PThom, SM Kinase inhibitors US Patent  US9732063 Publication Date 8/15/2017 
Target
Name:
Glycogen synthase kinase-3 alpha
Synonyms:
GSK-3 alpha GSK3A_HUMAN Glycogen synthase kinase-3 Glycogen synthase kinase-3 alpha (GSK3 Alpha) Glycogen synthase kinase-3 alpha (GSK3alpha)
Type:
Enzyme
Mol. Mass.:
50991.79
Organism:
Homo sapiens (Human)
Description:
P49840
Residue:
483
  
Inhibitor
Name:
BDBM334327
Synonyms:
3-(4-((4-(3-(3-Isopropyl-1-(p-tolyl)-1H-pyrazol-5-yl)ureido)naphthalen-1-yl)oxy)pyrimidin-2-yl)amino)phenyl methanesulfonate | US9732063, Example 11
Type:
Small organic molecule
Emp. Form.:
C35H33N7O5S
Mol. Mass.:
663.745
SMILES:
CC(C)c1cc(NC(=O)Nc2ccc(Oc3ccnc(Nc4cccc(OS(C)(=O)=O)c4)n3)c3ccccc23)n(n1)-c1ccc(C)cc1
: