Target
Mitogen-activated protein kinase 12
Ligand
BDBM334351
Substrate
Meas. Tech.
Enzyme Inhibition Assay
IC50
487±n/a nM
Citation
 Frickel, FFyfe, MCMeghani, PThom, SM Kinase inhibitors US Patent  US9732063 Publication Date 8/15/2017 
Target
Name:
Mitogen-activated protein kinase 12
Synonyms:
ERK6 MAPK12 Mitogen-activated protein kinase 12 (MAPK12 p38 gamma) Mitogen-activated protein kinase 12 Gamma SAPK3 | p38 delta/gamma
Type:
Protein
Mol. Mass.:
41938.69
Organism:
Homo sapiens (Human)
Description:
P53778
Residue:
367
  
Inhibitor
Name:
BDBM334351
Synonyms:
1-(2,3-Dichloro-4-((2-((3-methoxy-5-(2-(2-(2-methoxyethoxy)ethoxy)ethoxy)phenyl)-amino)pyrimidin-4-yl)oxy)phenyl)-3-(3-isopropyl-1-(p-tolyl)-1H-pyrazol-5-yl)urea | US9732063, Example 35
Type:
Small organic molecule
Emp. Form.:
C38H43Cl2N7O7
Mol. Mass.:
780.697
SMILES:
COCCOCCOCCOc1cc(Nc2nccc(Oc3ccc(NC(=O)Nc4cc(nn4-c4ccc(C)cc4)C(C)C)c(Cl)c3Cl)n2)cc(OC)c1
: