Target
Mitogen-activated protein kinase 12
Ligand
BDBM334367
Substrate
Meas. Tech.
Enzyme Inhibition Assay
IC50
53.0±n/a nM
Citation
 Frickel, FFyfe, MCMeghani, PThom, SM Kinase inhibitors US Patent  US9732063 Publication Date 8/15/2017 
Target
Name:
Mitogen-activated protein kinase 12
Synonyms:
ERK6 MAPK12 Mitogen-activated protein kinase 12 (MAPK12 p38 gamma) Mitogen-activated protein kinase 12 Gamma SAPK3 | p38 delta/gamma
Type:
Protein
Mol. Mass.:
41938.69
Organism:
Homo sapiens (Human)
Description:
P53778
Residue:
367
  
Inhibitor
Name:
BDBM334367
Synonyms:
1-(4-((2-((3-(2,5,8,11,14,17,20-Heptaoxadocosan-22-yloxy)-5-methoxyphenyl)amino)pyrimidin-4-yl)oxy)naphthalen-1-yl)-3-(3-(tert-butyl)-1-(p-tolyl)-1H-pyrazol-5-yl)urea | US9732063, Example 51
Type:
Small organic molecule
Emp. Form.:
C51H65N7O11
Mol. Mass.:
952.1021
SMILES:
c1cc(Nc2nccc(Oc3ccc(NC(=O)Nc4cc(nn4-c4ccc(C)cc4)C(C)(C)C)c4ccccc34)n2)cc(OC)c1
: