Target
Glycogen synthase kinase-3 alpha
Ligand
BDBM334367
Substrate
Meas. Tech.
Enzyme Inhibition Assay
IC50
1327±n/a nM
Citation
 Frickel, FFyfe, MCMeghani, PThom, SM Kinase inhibitors US Patent  US9732063 Publication Date 8/15/2017 
Target
Name:
Glycogen synthase kinase-3 alpha
Synonyms:
GSK-3 alpha GSK3A_HUMAN Glycogen synthase kinase-3 Glycogen synthase kinase-3 alpha (GSK3 Alpha) Glycogen synthase kinase-3 alpha (GSK3alpha)
Type:
Enzyme
Mol. Mass.:
50991.79
Organism:
Homo sapiens (Human)
Description:
P49840
Residue:
483
  
Inhibitor
Name:
BDBM334367
Synonyms:
1-(4-((2-((3-(2,5,8,11,14,17,20-Heptaoxadocosan-22-yloxy)-5-methoxyphenyl)amino)pyrimidin-4-yl)oxy)naphthalen-1-yl)-3-(3-(tert-butyl)-1-(p-tolyl)-1H-pyrazol-5-yl)urea | US9732063, Example 51
Type:
Small organic molecule
Emp. Form.:
C51H65N7O11
Mol. Mass.:
952.1021
SMILES:
c1cc(Nc2nccc(Oc3ccc(NC(=O)Nc4cc(nn4-c4ccc(C)cc4)C(C)(C)C)c4ccccc34)n2)cc(OC)c1
: