Target
Glycogen synthase kinase-3 alpha
Ligand
BDBM334386
Substrate
Meas. Tech.
Enzyme Inhibition Assay
IC50
3352±n/a nM
Citation
 Frickel, FFyfe, MCMeghani, PThom, SM Kinase inhibitors US Patent  US9732063 Publication Date 8/15/2017 
Target
Name:
Glycogen synthase kinase-3 alpha
Synonyms:
GSK-3 alpha GSK3A_HUMAN Glycogen synthase kinase-3 Glycogen synthase kinase-3 alpha (GSK3 Alpha) Glycogen synthase kinase-3 alpha (GSK3alpha)
Type:
Enzyme
Mol. Mass.:
50991.79
Organism:
Homo sapiens (Human)
Description:
P49840
Residue:
483
  
Inhibitor
Name:
BDBM334386
Synonyms:
1-(3-(tert-Butyl)-1-(4-methoxyphenyl)-1H-pyrazol-5-yl)-3-(4-((2-((3-(cyclopropylsulfonyl)-5-methoxyphenyl)amino)pyrimidin-4-yl)oxy)naphthalen-1-yl)urea | US9732063, Example 70
Type:
Small organic molecule
Emp. Form.:
C39H39N7O6S
Mol. Mass.:
733.835
SMILES:
COc1ccc(cc1)-n1nc(cc1NC(=O)Nc1ccc(Oc2ccnc(Nc3cc(OC)cc(c3)S(=O)(=O)C3CC3)n2)c2ccccc12)C(C)(C)C
: