Target
Protein arginine N-methyltransferase 5
Ligand
BDBM297747
Substrate
Meas. Tech.
Biochemical Assay
IC50
550±n/a nM
Citation
 Duncan, KWChesworth, RBoriack-Sjodin, PAMunchhof, MJ PRMT5 inhibitors and uses thereof US Patent  US9732072 Publication Date 8/15/2017 
Target
Name:
Protein arginine N-methyltransferase 5
Synonyms:
72 kDa ICln-binding protein HRMT1L5 IBP72 Jak-binding protein 1 PRMT5/MEP50 complex Protein arginine methyltransferase 5 (PRMT5) SKB1 homolog Shk1 kinase-binding protein 1 homolog
Type:
Enzyme
Mol. Mass.:
72679.99
Organism:
Homo sapiens (Human)
Description:
O14744
Residue:
637
  
Inhibitor
Name:
BDBM297747
Synonyms:
US10118918, Compound 26 | US9732072, Compound 26
Type:
Small organic molecule
Emp. Form.:
C22H27N3O4
Mol. Mass.:
397.4675
SMILES:
CN1CCOc2cccc(OCC(=O)NC[C@H](O)CN3Cc4ccccc4C3)c12
: