Target
Orexin/Hypocretin receptor type 1
Ligand
BDBM334656
Substrate
Meas. Tech.
Inhibition Assay
IC50
1.000±n/a nM
Citation
 Boss, CBrotschi, CGude, MHeidmann, BSifferlen, TWilliams, J Benzimidazole-proline derivatives US Patent  US9732075 Publication Date 8/15/2017 
Target
Name:
Orexin/Hypocretin receptor type 1
Synonyms:
HCRTR1 OX1R_HUMAN Orexin receptor type 1 (OR 1) Orexin receptor type 1 (OX1) Orexin receptor type 1 (OxR1) | Ox1r
Type:
Protein
Mol. Mass.:
47554.50
Organism:
Homo sapiens (Human)
Description:
O43613
Residue:
425
  
Inhibitor
Name:
BDBM334656
Synonyms:
US11040966, Example 4.21 [(2S,3S)-2-(5-Chloro-4-methyl-1H-benzoimidazol-2-yl)-3-methyl-pyrrolidin-1-yl]-[5-(3-chloro-phenyl)-2-methyl-thiazol-4-yl]-methanone
Type:
Small organic molecule
Emp. Form.:
C24H22Cl2N4OS
Mol. Mass.:
485.429
SMILES:
C[C@H]1CCN([C@@H]1c1nc2c(C)c(Cl)ccc2[nH]1)C(=O)c1nc(C)sc1-c1cccc(Cl)c1
: